[Tanya] Error Masalah Backtrack !!

Pertanyaan umum seputar distribusi Ubuntu yang menjadi distro wajib members ubuntu-indonesia.com
User avatar
Hjaking
Posts: 1
Joined: 09 Mar 2013, 09:03

[Tanya] Error Masalah Backtrack !!

Postby Hjaking » 09 Mar 2013, 09:07

Solusinya gmn Nih ya ... ??

Gem::Installer::ExtensionBuildError: ERROR: Failed to build gem native extension.

/usr/bin/ruby1.9.2 extconf.rb
checking for rb_trap_immediate in ruby.h,rubysig.h... no
checking for rb_thread_blocking_region()... yes
checking for inotify_init() in sys/inotify.h... yes
checking for writev() in sys/uio.h... yes
checking for rb_thread_check_ints()... yes
checking for rb_time_new()... yes
checking for sys/event.h... no
checking for epoll_create() in sys/epoll.h... yes
creating Makefile

make
g++ -I. -I/usr/include/ruby-1.9.2/i486-linux -I/usr/include/ruby-1.9.2/ruby/backward -I/usr/include/ruby-1.9.2 -I. -DBUILD_FOR_RUBY -DHAVE_RB_THREAD_BLOCKING_REGION -DHAVE_TBR -DHAVE_INOTIFY_INIT -DHAVE_INOTIFY -DHAVE_WRITEV -DHAVE_WRITEV -DHAVE_RB_THREAD_CHECK_INTS -DHAVE_RB_TIME_NEW -DOS_UNIX -DHAVE_EPOLL_CREATE -DHAVE_EPOLL -DWITH_SSL -DHAVE_MAKE_PAIR -D_FILE_OFFSET_BITS=64 -fPIC -fno-strict-aliasing -g -g -O2 -fPIC -fno-strict-aliasing -g -o files.o -c files.cpp
In file included from /usr/include/sys/socket.h:40,
from /usr/include/netinet/in.h:25,
from /usr/include/netdb.h:28,
from project.h:41,
from files.cpp:20:
/usr/include/bits/socket.h:366:24: error: asm/socket.h: No such file or directory
In file included from /usr/include/bits/errno.h:25,
from /usr/include/errno.h:36,
from project.h:53,
from files.cpp:20:
/usr/include/linux/errno.h:4:23: error: asm/errno.h: No such file or directory
make: *** [files.o] Error 1


Gem files will remain installed in /var/lib/gems/1.9.2/gems/eventmachine-0.12.10 for inspection.
Results logged to /var/lib/gems/1.9.2/gems/eventmachine-0.12.10/ext/gem_make.out

An error occurred while installing eventmachine (0.12.10), and Bundler cannot continue.
Make sure that `gem install eventmachine -v '0.12.10'` succeeds before bundling.
dpkg: error processing beef (--configure):
subprocess installed post-installation script returned error exit status 5
No apport report written because MaxReports is reached already
Errors were encountered while processing:
rubygems
rubygems1.8
tex-common
texlive-common
texlive-extra-utils
texlive-latex-base
texlive-latex-base-doc
texlive-luatex
beef
E: Sub-process /usr/bin/dpkg returned an error code (1)
root@bt:~#
:linux:
User avatar
br4v3h34rt
Posts: 141
Joined: 07 Nov 2012, 22:30
Location: Jakarta yang sering macet

Re: [Tanya] Error Masalah Backtrack !!

Postby br4v3h34rt » 09 Mar 2013, 16:24

dpkg --configure -a
apt-get install -f


coba liat hasilnya masih ada error gak? kalo gak ada coba install ulang beefnya..
User avatar
nif
Posts: 2816
Joined: 31 Mar 2011, 07:48

Re: [Tanya] Error Masalah Backtrack !!

Postby nif » 09 Mar 2013, 20:06

install dari source code ya?

Return to “Pertanyaan Umum”

Who is online

Users browsing this forum: No registered users and 6 guests