Tanya error pas di auto remove

Pertanyaan umum seputar distribusi Ubuntu yang menjadi distro wajib members ubuntu-indonesia.com
User avatar
chakkyboys
Posts: 34
Joined: 16 Nov 2012, 01:28

Tanya error pas di auto remove

Postby chakkyboys » 20 Nov 2012, 22:00

ini kenapa ya pas di apt-get autoremove muncul ini
Buka aja
root@hacker-Presario-CQ42-Notebook-PC:/home/hacker/Downloads# apt-get autoremove
Reading package lists... Done
Building dependency tree
Reading state information... Done
0 upgraded, 0 newly installed, 0 to remove and 0 not upgraded.
1 not fully installed or removed.
After this operation, 0 B of additional disk space will be used.
Can't locate auto/POSIX/autosplit.ix in @INC (@INC contains: /etc/perl /usr/local/lib/perl/5.14.2 /usr/local/share/perl/5.14.2 /usr/lib/perl5 /usr/share/perl5 /usr/lib/perl/5.14 /usr/share/perl/5.14 /usr/local/lib/site_perl .) at /usr/share/perl/5.14/AutoLoader.pm line 173.
at /usr/lib/perl/5.14/POSIX.pm line 9
debconf: Perl may be unconfigured (Can't locate loadable object for module POSIX in @INC (@INC contains: /etc/perl /usr/local/lib/perl/5.14.2 /usr/local/share/perl/5.14.2 /usr/lib/perl5 /usr/share/perl5 /usr/lib/perl/5.14 /usr/share/perl/5.14 /usr/local/lib/site_perl .) at /usr/share/perl5/Debconf/Template.pm line 7
Compilation failed in require at /usr/share/perl5/Debconf/Template.pm line 7.
BEGIN failed--compilation aborted at /usr/share/perl5/Debconf/Template.pm line 7.
Compilation failed in require at /usr/share/perl5/Debconf/Question.pm line 8.
BEGIN failed--compilation aborted at /usr/share/perl5/Debconf/Question.pm line 8.
Compilation failed in require at /usr/share/perl5/Debconf/Config.pm line 7.
BEGIN failed--compilation aborted at /usr/share/perl5/Debconf/Config.pm line 7.
Compilation failed in require at /usr/share/perl5/Debconf/Log.pm line 10.
Compilation failed in require at (eval 1) line 4.
BEGIN failed--compilation aborted at (eval 1) line 4.
) -- aborting
Setting up man-db (2.6.3-1) ...
Can't locate auto/POSIX/autosplit.ix in @INC (@INC contains: /etc/perl /usr/local/lib/perl/5.14.2 /usr/local/share/perl/5.14.2 /usr/lib/perl5 /usr/share/perl5 /usr/lib/perl/5.14 /usr/share/perl/5.14 /usr/local/lib/site_perl .) at /usr/share/perl/5.14/AutoLoader.pm line 173.
at /usr/lib/perl/5.14/POSIX.pm line 9
Can't locate loadable object for module POSIX in @INC (@INC contains: /etc/perl /usr/local/lib/perl/5.14.2 /usr/local/share/perl/5.14.2 /usr/lib/perl5 /usr/share/perl5 /usr/lib/perl/5.14 /usr/share/perl/5.14 /usr/local/lib/site_perl .) at /usr/share/perl5/Debconf/Template.pm line 7
Compilation failed in require at /usr/share/perl5/Debconf/Template.pm line 7.
BEGIN failed--compilation aborted at /usr/share/perl5/Debconf/Template.pm line 7.
Compilation failed in require at /usr/share/perl5/Debconf/Question.pm line 8.
BEGIN failed--compilation aborted at /usr/share/perl5/Debconf/Question.pm line 8.
Compilation failed in require at /usr/share/perl5/Debconf/Config.pm line 7.
BEGIN failed--compilation aborted at /usr/share/perl5/Debconf/Config.pm line 7.
Compilation failed in require at /usr/share/perl5/Debconf/Log.pm line 10.
Compilation failed in require at /usr/share/perl5/Debconf/Db.pm line 7.
BEGIN failed--compilation aborted at /usr/share/perl5/Debconf/Db.pm line 7.
Compilation failed in require at /usr/share/debconf/frontend line 6.
BEGIN failed--compilation aborted at /usr/share/debconf/frontend line 6.
dpkg: error processing man-db (--configure):
subprocess installed post-installation script returned error exit status 2
Errors were encountered while processing:
man-db
E: Sub-process /usr/bin/dpkg returned an error code (1)
root@hacker-Presario-CQ42-Notebook-PC:/home/hacker/Downloads#
User avatar
chakkyboys
Posts: 34
Joined: 16 Nov 2012, 01:28

Re: Tanya error pas di auto remove

Postby chakkyboys » 20 Nov 2012, 22:05

tolong gan . ane baru pakek ubuntu soal nya :'(
User avatar
q_p
Posts: 3109
Joined: 14 Oct 2012, 13:01
Contact:

Re: Tanya error pas di auto remove

Postby q_p » 20 Nov 2012, 22:22

Apakah ini terjadi setelah anda upgrade ke ubuntu 12.10 ??

Dari pesan error-nya hampir semua mengarah ke perl 5.14.2

Code: Select all

at /usr/share/perl/5.14/AutoLoader.pm line 173.
at /usr/lib/perl/5.14/POSIX.pm line 9
at /usr/share/perl5/Debconf/Template.pm line 7
at /usr/share/perl5/Debconf/Question.pm line 8.
at /usr/share/perl5/Debconf/Config.pm line 7.
at /usr/share/perl5/Debconf/Log.pm line 10.
at /usr/share/perl5/Debconf/Db.pm line 7.
at /usr/share/debconf/frontend line 6.
apa ini yang disebut bug, seperti disebutkan di sini ?
User avatar
chakkyboys
Posts: 34
Joined: 16 Nov 2012, 01:28

Re: Tanya error pas di auto remove

Postby chakkyboys » 21 Nov 2012, 00:27

solusinya gimana ?
User avatar
q_p
Posts: 3109
Joined: 14 Oct 2012, 13:01
Contact:

Re: Tanya error pas di auto remove

Postby q_p » 21 Nov 2012, 03:41

Mohon maaf saya hanya berasumsi, kalau misalnya itu bug. Sabar saja, kita tunggu sampai developer-nya menghilangkan bugs tsb. Atau, (Sambil nunggu guru2 kita lewat sini) anggap saja asumsi saya salah.
User avatar
chakkyboys
Posts: 34
Joined: 16 Nov 2012, 01:28

Re: Tanya error pas di auto remove

Postby chakkyboys » 21 Nov 2012, 15:11

itu cuma bug / ada yang erorr ?
User avatar
q_p
Posts: 3109
Joined: 14 Oct 2012, 13:01
Contact:

Re: Tanya error pas di auto remove

Postby q_p » 21 Nov 2012, 15:26

BTW, pakai ubuntu yang mana mas? Menurut saya sih, tidak apa-apa selama ubuntu masih bisa jalan.
User avatar
chakkyboys
Posts: 34
Joined: 16 Nov 2012, 01:28

Re: Tanya error pas di auto remove

Postby chakkyboys » 21 Nov 2012, 16:38

pakek 12.10 . saya tidak upgrade dari versi sebelum nya . tp langsung install 12.10
User avatar
q_p
Posts: 3109
Joined: 14 Oct 2012, 13:01
Contact:

Re: Tanya error pas di auto remove

Postby q_p » 21 Nov 2012, 19:15

Kalau itu memang mengganggu, gak ada salahnya install ulang. Itung2 sebagai latihan dan coba dulu yang versi LTS, ubuntu 10.04 lts misalnya.
User avatar
nif
Posts: 2818
Joined: 31 Mar 2011, 07:48

Re: Tanya error pas di auto remove

Postby nif » 23 Nov 2012, 08:44

chakkyboys wrote:Reading package lists... Done
Building dependency tree
Reading state information... Done
0 upgraded, 0 newly installed, 0 to remove and 0 not upgraded.
1 not fully installed or removed.
...
debconf: Perl may be unconfigured
...

Sepertinya masalahnya bukan karena autoremove, tapi karena ada paket (yaitu Perl) yang tidak terkonfigurasi dengan baik.
Coba sudo apt-get install --reinstall perl bagaimana hasilnya?

cmiiw
User avatar
chakkyboys
Posts: 34
Joined: 16 Nov 2012, 01:28

Re: Tanya error pas di auto remove

Postby chakkyboys » 23 Nov 2012, 12:18

root@hacker-Presario-CQ42-Notebook-PC:/home/hacker/Downloads# apt-get install --reinstall perl
Reading package lists... Done
Building dependency tree
Reading state information... Done
Reinstallation of perl is not possible, it cannot be downloaded.
0 upgraded, 0 newly installed, 0 to remove and 0 not upgraded.
1 not fully installed or removed.
After this operation, 0 B of additional disk space will be used.
Do you want to continue [Y/n]? y
Can't locate auto/POSIX/autosplit.ix in @INC (@INC contains: /etc/perl /usr/local/lib/perl/5.14.2 /usr/local/share/perl/5.14.2 /usr/lib/perl5 /usr/share/perl5 /usr/lib/perl/5.14 /usr/share/perl/5.14 /usr/local/lib/site_perl .) at /usr/share/perl/5.14/AutoLoader.pm line 173.
at /usr/lib/perl/5.14/POSIX.pm line 9
debconf: Perl may be unconfigured (Can't locate loadable object for module POSIX in @INC (@INC contains: /etc/perl /usr/local/lib/perl/5.14.2 /usr/local/share/perl/5.14.2 /usr/lib/perl5 /usr/share/perl5 /usr/lib/perl/5.14 /usr/share/perl/5.14 /usr/local/lib/site_perl .) at /usr/share/perl5/Debconf/Template.pm line 7
Compilation failed in require at /usr/share/perl5/Debconf/Template.pm line 7.
BEGIN failed--compilation aborted at /usr/share/perl5/Debconf/Template.pm line 7.
Compilation failed in require at /usr/share/perl5/Debconf/Question.pm line 8.
BEGIN failed--compilation aborted at /usr/share/perl5/Debconf/Question.pm line 8.
Compilation failed in require at /usr/share/perl5/Debconf/Config.pm line 7.
BEGIN failed--compilation aborted at /usr/share/perl5/Debconf/Config.pm line 7.
Compilation failed in require at /usr/share/perl5/Debconf/Log.pm line 10.
Compilation failed in require at (eval 1) line 4.
BEGIN failed--compilation aborted at (eval 1) line 4.
) -- aborting
Setting up man-db (2.6.3-1) ...
Can't locate auto/POSIX/autosplit.ix in @INC (@INC contains: /etc/perl /usr/local/lib/perl/5.14.2 /usr/local/share/perl/5.14.2 /usr/lib/perl5 /usr/share/perl5 /usr/lib/perl/5.14 /usr/share/perl/5.14 /usr/local/lib/site_perl .) at /usr/share/perl/5.14/AutoLoader.pm line 173.
at /usr/lib/perl/5.14/POSIX.pm line 9
Can't locate loadable object for module POSIX in @INC (@INC contains: /etc/perl /usr/local/lib/perl/5.14.2 /usr/local/share/perl/5.14.2 /usr/lib/perl5 /usr/share/perl5 /usr/lib/perl/5.14 /usr/share/perl/5.14 /usr/local/lib/site_perl .) at /usr/share/perl5/Debconf/Template.pm line 7
Compilation failed in require at /usr/share/perl5/Debconf/Template.pm line 7.
BEGIN failed--compilation aborted at /usr/share/perl5/Debconf/Template.pm line 7.
Compilation failed in require at /usr/share/perl5/Debconf/Question.pm line 8.
BEGIN failed--compilation aborted at /usr/share/perl5/Debconf/Question.pm line 8.
Compilation failed in require at /usr/share/perl5/Debconf/Config.pm line 7.
BEGIN failed--compilation aborted at /usr/share/perl5/Debconf/Config.pm line 7.
Compilation failed in require at /usr/share/perl5/Debconf/Log.pm line 10.
Compilation failed in require at /usr/share/perl5/Debconf/Db.pm line 7.
BEGIN failed--compilation aborted at /usr/share/perl5/Debconf/Db.pm line 7.
Compilation failed in require at /usr/share/debconf/frontend line 6.
BEGIN failed--compilation aborted at /usr/share/debconf/frontend line 6.
dpkg: error processing man-db (--configure):
subprocess installed post-installation script returned error exit status 2
Errors were encountered while processing:
man-db
E: Sub-process /usr/bin/dpkg returned an error code (1)
root@hacker-Presario-CQ42-Notebook-PC:/home/hacker/Downloads#
User avatar
offline
Posts: 2672
Joined: 17 Feb 2010, 21:03
Location: Kebumen

Re: Tanya error pas di auto remove

Postby offline » 23 Nov 2012, 12:50

btw sudah coba masuk sesi recovery mode lalu repair di situkah?
User avatar
offline
Posts: 2672
Joined: 17 Feb 2010, 21:03
Location: Kebumen

Re: Tanya error pas di auto remove

Postby offline » 23 Nov 2012, 13:02

coba salin konfigurasi dari /usr/share/debconf/debconf.conf ke /etc/debconf.conf. konfigurasi yg lama di /etc/debconf.conf dihapus aja trus diganti konfig dari /usr/share/debconf/debconf.conf
source http://ubuntuforums.org/showthread.php?t=1948434
User avatar
q_p
Posts: 3109
Joined: 14 Oct 2012, 13:01
Contact:

Re: Tanya error pas di auto remove

Postby q_p » 23 Nov 2012, 13:34

Kalau mau coba, di purge saja :

Code: Select all

apt-get purge perl
#####setelah itu install lagi
apt-get install perl
reff=
https://help.ubuntu.com/community/AptGet/Howto
User avatar
nif
Posts: 2818
Joined: 31 Mar 2011, 07:48

Re: Tanya error pas di auto remove

Postby nif » 24 Nov 2012, 09:47

Nambahin, kalo masih gagal juga, coba pake sudo dpkg --configure -a baru kemudian reinstall perl.

cmiiw
User avatar
chakkyboys
Posts: 34
Joined: 16 Nov 2012, 01:28

Re: Tanya error pas di auto remove

Postby chakkyboys » 24 Nov 2012, 19:01

keluar gini

Tampilkan
root@hacker-Presario-CQ42-Notebook-PC:/home/hacker# apt-get -f installReading package lists... Done
Building dependency tree
Reading state information... Done
Correcting dependencies... Done
The following packages were automatically installed and are no longer required:
apache2-utils dockmanager libaio1 libgdiplus libgnome-desktop-2-17
libmono-cairo4.0-cil libmono-corlib4.0-cil libmono-data-tds4.0-cil
libmono-i18n-west4.0-cil libmono-i18n4.0-cil libmono-posix4.0-cil
libmono-security4.0-cil libmono-sharpzip4.84-cil libmono-sqlite4.0-cil
libmono-system-configuration4.0-cil libmono-system-core4.0-cil
libmono-system-data4.0-cil libmono-system-drawing4.0-cil
libmono-system-enterpriseservices4.0-cil libmono-system-security4.0-cil
libmono-system-transactions4.0-cil
libmono-system-web-applicationservices4.0-cil
libmono-system-web-services4.0-cil libmono-system-web4.0-cil
libmono-system-xml-linq4.0-cil libmono-system-xml4.0-cil
libmono-system4.0-cil libmono-web4.0-cil libmysqlclient18 mono-4.0-gac
mono-gac mono-runtime mysql-client-core-5.5 mysql-common
mysql-server-core-5.5 python-mpd python-mutagen re2c spamc
Use 'apt-get autoremove' to remove them.
The following packages will be REMOVED:
cups-bsd mysql-server-5.5
0 upgraded, 0 newly installed, 2 to remove and 0 not upgraded.
4 not fully installed or removed.
After this operation, 31.5 MB disk space will be freed.
Do you want to continue [Y/n]? y
debconf: Perl may be unconfigured (Can't locate strict.pm in @INC (@INC contains: /etc/perl /usr/local/lib/perl/5.14.2 /usr/local/share/perl/5.14.2 /usr/lib/perl5 /usr/share/perl5 /usr/lib/perl/5.14 /usr/share/perl/5.14 /usr/local/lib/site_perl .) at (eval 1) line 2.
BEGIN failed--compilation aborted at (eval 1) line 2.
) -- aborting
(Reading database ... 209256 files and directories currently installed.)
Removing cups-bsd ...
/var/lib/dpkg/info/cups-bsd.prerm: 28: /var/lib/dpkg/info/cups-bsd.prerm: update-inetd: not found
dpkg: error processing cups-bsd (--remove):
subprocess installed pre-removal script returned error exit status 127
Can't locate strict.pm in @INC (@INC contains: /etc/perl /usr/local/lib/perl/5.14.2 /usr/local/share/perl/5.14.2 /usr/lib/perl5 /usr/share/perl5 /usr/lib/perl/5.14 /usr/share/perl/5.14 /usr/local/lib/site_perl .) at /usr/share/debconf/frontend line 5.
BEGIN failed--compilation aborted at /usr/share/debconf/frontend line 5.
dpkg: error while cleaning up:
subprocess installed post-installation script returned error exit status 2
Removing mysql-server-5.5 ...
Can't locate strict.pm in @INC (@INC contains: /etc/perl /usr/local/lib/perl/5.14.2 /usr/local/share/perl/5.14.2 /usr/lib/perl5 /usr/share/perl5 /usr/lib/perl/5.14 /usr/share/perl/5.14 /usr/local/lib/site_perl .) at /usr/share/debconf/frontend line 5.
BEGIN failed--compilation aborted at /usr/share/debconf/frontend line 5.
dpkg: error processing mysql-server-5.5 (--remove):
subprocess installed pre-removal script returned error exit status 2
Errors were encountered while processing:
cups-bsd
mysql-server-5.5
E: Sub-process /usr/bin/dpkg returned an error code (1)
root@hacker-Presario-CQ42-Notebook-PC:/home/hacker#
User avatar
q_p
Posts: 3109
Joined: 14 Oct 2012, 13:01
Contact:

Re: Tanya error pas di auto remove

Postby q_p » 24 Nov 2012, 19:34

Perasaan yang di atas tidak ada yang memberi masukan :

Code: Select all

apt-get -f install
Ini apa yang di-force install mas ?

Return to “Pertanyaan Umum”

Who is online

Users browsing this forum: No registered users and 20 guests