Pesan Error pada Update Manager

Semua mengenai lingkungan desktop Ubuntu.
User avatar
mbenk
Posts: 31
Joined: 13 Jun 2012, 17:07
Location: surabaya - indonesia
Contact:

Pesan Error pada Update Manager

Postby mbenk » 23 Jul 2012, 14:22

beberapa hari ini tiap aku jalankan update manager selalu mendapatkan pesan error, contohnya hari ini aku dapat pesan error seperti ini
installArchives() failed: perl: warning: Setting locale failed.
perl: warning: Please check that your locale settings:
LANGUAGE = (unset),
LC_ALL = (unset),
LANG = "id_ID.UTF-8"
are supported and installed on your system.
perl: warning: Falling back to the standard locale ("C").
locale: Cannot set LC_CTYPE to default locale: No such file or directory
locale: Cannot set LC_MESSAGES to default locale: No such file or directory
locale: Cannot set LC_ALL to default locale: No such file or directory
Preconfiguring packages ...
Can't exec "/tmp/resolvconf.config.61411": Permission denied at /usr/share/perl/5.14/IPC/Open3.pm line 186, line 1.
open2: exec of /tmp/resolvconf.config.61411 configure 1.63ubuntu14 failed at /usr/share/perl5/Debconf/ConfModule.pm line 59
perl: warning: Setting locale failed.
perl: warning: Please check that your locale settings:
LANGUAGE = (unset),
LC_ALL = (unset),
LANG = "id_ID.UTF-8"
are supported and installed on your system.
perl: warning: Falling back to the standard locale ("C").
locale: Cannot set LC_CTYPE to default locale: No such file or directory
locale: Cannot set LC_MESSAGES to default locale: No such file or directory
locale: Cannot set LC_ALL to default locale: No such file or directory
Preconfiguring packages ...
Can't exec "/tmp/resolvconf.config.61731": Permission denied at /usr/share/perl/5.14/IPC/Open3.pm line 186, line 1.
open2: exec of /tmp/resolvconf.config.61731 configure 1.63ubuntu14 failed at /usr/share/perl5/Debconf/ConfModule.pm line 59
perl: warning: Setting locale failed.
perl: warning: Please check that your locale settings:
LANGUAGE = (unset),
LC_ALL = (unset),
LANG = "id_ID.UTF-8"
are supported and installed on your system.
perl: warning: Falling back to the standard locale ("C").
locale: Cannot set LC_CTYPE to default locale: No such file or directory
locale: Cannot set LC_MESSAGES to default locale: No such file or directory
locale: Cannot set LC_ALL to default locale: No such file or directory
Preconfiguring packages ...
Can't exec "/tmp/resolvconf.config.62031": Permission denied at /usr/share/perl/5.14/IPC/Open3.pm line 186, line 1.
open2: exec of /tmp/resolvconf.config.62031 configure 1.63ubuntu14 failed at /usr/share/perl5/Debconf/ConfModule.pm line 59
perl: warning: Setting locale failed.
perl: warning: Please check that your locale settings:
LANGUAGE = (unset),
LC_ALL = (unset),
LANG = "id_ID.UTF-8"
are supported and installed on your system.
perl: warning: Falling back to the standard locale ("C").
locale: Cannot set LC_CTYPE to default locale: No such file or directory
locale: Cannot set LC_MESSAGES to default locale: No such file or directory
locale: Cannot set LC_ALL to default locale: No such file or directory
Preconfiguring packages ...
Can't exec "/tmp/resolvconf.config.62481": Permission denied at /usr/share/perl/5.14/IPC/Open3.pm line 186, line 1.
open2: exec of /tmp/resolvconf.config.62481 configure 1.63ubuntu14 failed at /usr/share/perl5/Debconf/ConfModule.pm line 59
(Reading database ...
(Reading database ... 5%%
(Reading database ... 10%%
(Reading database ... 15%%
(Reading database ... 20%%
(Reading database ... 25%%
(Reading database ... 30%%
(Reading database ... 35%%
(Reading database ... 40%%
(Reading database ... 45%%
(Reading database ... 50%%
(Reading database ... 55%%
(Reading database ... 60%%
(Reading database ... 65%%
(Reading database ... 70%%
(Reading database ... 75%%
(Reading database ... 80%%
(Reading database ... 85%%
(Reading database ... 90%%
(Reading database ... 95%%
(Reading database ... 100%%
(Reading database ... 441142 files and directories currently installed.)
Preparing to replace resolvconf 1.63ubuntu14 (using .../resolvconf_1.63ubuntu15_all.deb) ...
Unpacking replacement resolvconf ...
locale: Cannot set LC_CTYPE to default locale: No such file or directory
locale: Cannot set LC_MESSAGES to default locale: No such file or directory
locale: Cannot set LC_ALL to default locale: No such file or directory
Preparing to replace python-software-properties 0.82.7.1 (using .../python-software-properties_0.82.7.2_all.deb) ...
Unpacking replacement python-software-properties ...
Preparing to replace software-properties-common 0.82.7.1 (using .../software-properties-common_0.82.7.2_all.deb) ...
Unpacking replacement software-properties-common ...
Preparing to replace software-properties-gtk 0.82.7.1 (using .../software-properties-gtk_0.82.7.2_all.deb) ...
Unpacking replacement software-properties-gtk ...
Processing triggers for man-db ...
locale: Cannot set LC_CTYPE to default locale: No such file or directory
locale: Cannot set LC_MESSAGES to default locale: No such file or directory
locale: Cannot set LC_ALL to default locale: No such file or directory
Processing triggers for ureadahead ...
ureadahead will be reprofiled on next reboot
Processing triggers for bamfdaemon ...
Rebuilding /usr/share/applications/bamf.index...
Processing triggers for desktop-file-utils ...
Processing triggers for gnome-menus ...
Processing triggers for shared-mime-info ...
Unknown media type in type 'all/all'
Unknown media type in type 'all/allfiles'
Unknown media type in type 'uri/mms'
Unknown media type in type 'uri/mmst'
Unknown media type in type 'uri/mmsu'
Unknown media type in type 'uri/pnm'
Unknown media type in type 'uri/rtspt'
Unknown media type in type 'uri/rtspu'
Processing triggers for hicolor-icon-theme ...
Setting up linux-image-2.6.38 (2.6.38-10.00.Custom) ...
locale: Cannot set LC_CTYPE to default locale: No such file or directory
locale: Cannot set LC_MESSAGES to default locale: No such file or directory
locale: Cannot set LC_ALL to default locale: No such file or directory
Running depmod.
Examining /etc/kernel/postinst.d.
run-parts: executing /etc/kernel/postinst.d/initramfs-tools 2.6.38 /boot/vmlinuz-2.6.38
update-initramfs: Generating /boot/initrd.img-2.6.38
W: TMPDIR is mounted noexec, will not cache run scripts.
run-parts: executing /etc/kernel/postinst.d/pm-utils 2.6.38 /boot/vmlinuz-2.6.38
run-parts: executing /etc/kernel/postinst.d/update-notifier 2.6.38 /boot/vmlinuz-2.6.38
run-parts: executing /etc/kernel/postinst.d/zz-update-grub 2.6.38 /boot/vmlinuz-2.6.38
/usr/sbin/grub-mkconfig: 36: /etc/default/grub: Syntax error: Unterminated quoted string
run-parts: /etc/kernel/postinst.d/zz-update-grub exited with return code 2
Failed to process /etc/kernel/postinst.d at /var/lib/dpkg/info/linux-image-2.6.38.postinst line 341.
dpkg: error processing linux-image-2.6.38 (--configure):
subprocess installed post-installation script returned error exit status 2
No apport report written because MaxReports is reached already
Setting up linux-image-3.2.0-27-generic-pae (3.2.0-27.43) ...
Running depmod.
update-initramfs: deferring update (hook will be called later)
Examining /etc/kernel/postinst.d.
run-parts: executing /etc/kernel/postinst.d/initramfs-tools 3.2.0-27-generic-pae /boot/vmlinuz-3.2.0-27-generic-pae
update-initramfs: Generating /boot/initrd.img-3.2.0-27-generic-pae
W: TMPDIR is mounted noexec, will not cache run scripts.
run-parts: executing /etc/kernel/postinst.d/pm-utils 3.2.0-27-generic-pae /boot/vmlinuz-3.2.0-27-generic-pae
run-parts: executing /etc/kernel/postinst.d/update-notifier 3.2.0-27-generic-pae /boot/vmlinuz-3.2.0-27-generic-pae
run-parts: executing /etc/kernel/postinst.d/zz-update-grub 3.2.0-27-generic-pae /boot/vmlinuz-3.2.0-27-generic-pae
/usr/sbin/grub-mkconfig: 36: /etc/default/grub: Syntax error: Unterminated quoted string
run-parts: /etc/kernel/postinst.d/zz-update-grub exited with return code 2
Failed to process /etc/kernel/postinst.d at /var/lib/dpkg/info/linux-image-3.2.0-27-generic-pae.postinst line 1010.
dpkg: error processing linux-image-3.2.0-27-generic-pae (--configure):
subprocess installed post-installation script returned error exit status 2
dpkg: dependency problems prevent configuration of linux-image-generic-pae:
linux-image-generic-pae depends on linux-image-3.2.0-27-generic-pae; however:
Package linux-image-3.2.0-27-generic-pae is not configured yet.
dpkg: error processing linux-image-generic-pae (--configure):
dependency problems - leaving unconfigured
dpkg: dependency problems prevent configuration of linux-generic-pae:
linux-generic-pae depends on linux-image-generic-pae (= 3.2.0.27.29); however:
Package linux-image-generic-pae is not configured yet.
dpkg: error processing linux-generic-pae (--configure):
dependency problems - leaving unconfigured
dpkg: dependency problems prevent configuration of source-linux-image:
source-linux-image depends on linux-image-2.6.38; however:
Package linux-image-2.6.38 is not configured yet.
dpkg: error processing source-linux-image (--No apport report written because MaxReports is reached already
No apport report written because MaxReports is reached already
No apport report written because MaxReports is reached already
No apport report written because MaxReports is reached already
configure):
dependency problems - leaving unconfigured
Setting up resolvconf (1.63ubuntu15) ...
Installing new version of config file /etc/ppp/ip-up.d/000resolvconf ...
Installing new version of config file /etc/ppp/ip-down.d/000resolvconf ...
locale: Cannot set LC_CTYPE to default locale: No such file or directory
locale: Cannot set LC_MESSAGES to default locale: No such file or directory
locale: Cannot set LC_ALL to default locale: No such file or directory
Setting up python-software-properties (0.82.7.2) ...
Setting up software-properties-common (0.82.7.2) ...
Setting up software-properties-gtk (0.82.7.2) ...
Processing triggers for resolvconf ...
locale: Cannot set LC_CTYPE to default locale: No such file or directory
locale: Cannot set LC_MESSAGES to default locale: No such file or directory
locale: Cannot set LC_ALL to default locale: No such file or directory
Errors were encountered while processing:
linux-image-2.6.38
linux-image-3.2.0-27-generic-pae
linux-image-generic-pae
linux-generic-pae
source-linux-image
Error in function:
Setting up linux-image-2.6.38 (2.6.38-10.00.Custom) ...
locale: Cannot set LC_CTYPE to default locale: No such file or directory
locale: Cannot set LC_MESSAGES to default locale: No such file or directory
locale: Cannot set LC_ALL to default locale: No such file or directory
Running depmod.
Examining /etc/kernel/postinst.d.
run-parts: executing /etc/kernel/postinst.d/initramfs-tools 2.6.38 /boot/vmlinuz-2.6.38
update-initramfs: Generating /boot/initrd.img-2.6.38
W: TMPDIR is mounted noexec, will not cache run scripts.
run-parts: executing /etc/kernel/postinst.d/pm-utils 2.6.38 /boot/vmlinuz-2.6.38
run-parts: executing /etc/kernel/postinst.d/update-notifier 2.6.38 /boot/vmlinuz-2.6.38
run-parts: executing /etc/kernel/postinst.d/zz-update-grub 2.6.38 /boot/vmlinuz-2.6.38
/usr/sbin/grub-mkconfig: 36: /etc/default/grub: Syntax error: Unterminated quoted string
run-parts: /etc/kernel/postinst.d/zz-update-grub exited with return code 2
Failed to process /etc/kernel/postinst.d at /var/lib/dpkg/info/linux-image-2.6.38.postinst line 341.
dpkg: error processing linux-image-2.6.38 (--configure):
subprocess installed post-installation script returned error exit status 2
Setting up linux-image-3.2.0-27-generic-pae (3.2.0-27.43) ...
Running depmod.
update-initramfs: deferring update (hook will be called later)
Examining /etc/kernel/postinst.d.
run-parts: executing /etc/kernel/postinst.d/initramfs-tools 3.2.0-27-generic-pae /boot/vmlinuz-3.2.0-27-generic-pae
update-initramfs: Generating /boot/initrd.img-3.2.0-27-generic-pae
W: TMPDIR is mounted noexec, will not cache run scripts.
run-parts: executing /etc/kernel/postinst.d/pm-utils 3.2.0-27-generic-pae /boot/vmlinuz-3.2.0-27-generic-pae
run-parts: executing /etc/kernel/postinst.d/update-notifier 3.2.0-27-generic-pae /boot/vmlinuz-3.2.0-27-generic-pae
run-parts: executing /etc/kernel/postinst.d/zz-update-grub 3.2.0-27-generic-pae /boot/vmlinuz-3.2.0-27-generic-pae
/usr/sbin/grub-mkconfig: 36: /etc/default/grub: Syntax error: Unterminated quoted string
run-parts: /etc/kernel/postinst.d/zz-update-grub exited with return code 2
Failed to process /etc/kernel/postinst.d at /var/lib/dpkg/info/linux-image-3.2.0-27-generic-pae.postinst line 1010.
dpkg: error processing linux-image-3.2.0-27-generic-pae (--configure):
subprocess installed post-installation script returned error exit status 2
dpkg: dependency problems prevent configuration of linux-image-generic-pae:
linux-image-generic-pae depends on linux-image-3.2.0-27-generic-pae; however:
Package linux-image-3.2.0-27-generic-pae is not configured yet.
dpkg: error processing linux-image-generic-pae (--configure):
dependency problems - leaving unconfigured
dpkg: dependency problems prevent configuration of source-linux-image:
source-linux-image depends on linux-image-2.6.38; however:
Package linux-image-2.6.38 is not configured yet.
dpkg: error processing source-linux-image (--configure):
dependency problems - leaving unconfigured
dpkg: dependency problems prevent configuration of linux-generic-pae:
linux-generic-pae depends on linux-image-generic-pae (= 3.2.0.27.29); however:
Package linux-image-generic-pae is not configured yet.
dpkg: error processing linux-generic-pae (--configure):
dependency problems - leaving unconfigured
User avatar
Nexus
Posts: 2957
Joined: 26 Feb 2011, 12:39
Location: Ujung dunia

Re: Pesan Error pada Update Manager

Postby Nexus » 23 Jul 2012, 19:56

Buka & baca link pada signature gue tentang..

"Tutorial - apa yang harus dilakukan setelah installasi ubuntu". :grin:

Return to “Ubuntu Desktop”

Who is online

Users browsing this forum: No registered users and 1 guest